Parcel doesn't install

I saw many faced this issue but i don’t manage to fix it. I even got this message:

npm ERR! gyp ERR! find Python - “C:\Program Files\Python36-32\python.exe” could not be run
npm ERR! gyp ERR! find Python checking if Python is C:\Program Files (x86)\Python36-32\python.exe
npm ERR! gyp ERR! find Python - “C:\Program Files (x86)\Python36-32\python.exe” could not be run
npm ERR! gyp ERR! find Python checking if the py launcher can be used to find Python 3
npm ERR! gyp ERR! find Python - “py.exe” is not in PATH or produced an error
npm ERR! gyp ERR! find Python
npm ERR! gyp ERR! find Python **********************************************************
npm ERR! gyp ERR! find Python You need to install the latest version of Python.
npm ERR! gyp ERR! find Python Node-gyp should be able to find and use Python. If not,
npm ERR! gyp ERR! find Python you can try one of the following options:
PS C:\Users\Andrew\Desktop\Moshify2> npm i -D parcel-bundler
npm WARN config global --global, --local are deprecated. Use --location=global instead.
npm WARN deprecated source-map-url@0.4.1: See GitHub - lydell/source-map-url: [DEPRECATED] Tools for working with sourceMappingURL comments.
npm WARN deprecated request-promise-native@1.0.9: request-promise-native has been deprecated because it extends the now deprecated request package, see https://github.com/request/request/issues/3142
npm WARN deprecated har-validator@5.1.5: this library is no longer supported
npm WARN deprecated source-map-resolve@0.5.3: See GitHub - lydell/source-map-resolve: [DEPRECATED] Resolve the source map and/or sources for a generated file.
npm WARN deprecated chokidar@2.1.8: Chokidar 2 does not receive security updates since 2019. Upgrade to chokidar 3 with 15x fewer dependencies
npm WARN deprecated resolve-url@0.2.1: GitHub - lydell/resolve-url: [DEPRECATED] Like Node.js’ `path.resolve`/`url.resolve` for the browser.
npm WARN deprecated urix@0.1.0: Please see GitHub - lydell/urix: [DEPRECATED] Makes Windows-style paths more unix and URI friendly.
npm WARN deprecated querystring@0.2.0: The querystring API is considered Legacy. new code should use the URLSearchParams API instead.
npm WARN deprecated uuid@3.4.0: Please upgrade to version 7 or higher. Older versions may use Math.random() in certain circumstances, which is known to be problematic. See There’s Math.random(), and then there’s Math.random() · V8 for details.
npm WARN deprecated request@2.88.2: request has been deprecated, see https://github.com/request/request/issues/3142
npm WARN deprecated svgo@1.3.2: This SVGO version is no longer supported. Upgrade to v2.x.x.
npm WARN deprecated parcel-bundler@1.12.5: Parcel v1 is no longer maintained. Please migrate to v2, which is published under the ‘parcel’ package. See Migration for details.
npm WARN deprecated core-js@2.6.12: core-js@<3.4 is no longer maintained and not recommended for usage due to the number of issues. Because of the V8 engine whims, feature detection in old core-js versions could cause a slowdown up to 100x even if nothing is polyfilled. Please, upgrade your dependencies to the actual version of core-js.
npm ERR! code 1
npm ERR! path C:\Users\Andrew\Desktop\Moshify2\node_modules\deasync
npm ERR! command failed
npm ERR! command C:\WINDOWS\system32\cmd.exe /d /s /c node ./build.js
npm ERR! gyp info it worked if it ends with ok
npm ERR! gyp info using node-gyp@9.0.0
npm ERR! gyp info using node@18.3.0 | win32 | x64
npm ERR! gyp ERR! find Python
npm ERR! gyp ERR! find Python Python is not set from command line or npm configuration
npm ERR! gyp ERR! find Python Python is not set from environment variable PYTHON
npm ERR! gyp ERR! find Python checking if “python3” can be used
npm ERR! gyp ERR! find Python - “python3” is not in PATH or produced an error
npm ERR! gyp ERR! find Python checking if “python” can be used
npm ERR! gyp ERR! find Python - “python” is not in PATH or produced an error
npm ERR! gyp ERR! find Python checking if Python is C:\Users\Andrew\AppData\Local\Programs\Python\Python39\python.exe
npm ERR! gyp ERR! find Python - “C:\Users\Andrew\AppData\Local\Programs\Python\Python39\python.exe” could not be run
npm ERR! gyp ERR! find Python checking if Python is C:\Program Files\Python39\python.exe
npm ERR! gyp ERR! find Python - “C:\Program Files\Python39\python.exe” could not be run

PS C:\Users\Andrew\Desktop\Moshify2>

Session contents restored from 08/06/2022 at 17:35:28

Windows PowerShell
Copyright (C) Microsoft Corporation. All rights reserved.

Install the latest PowerShell for new features and improvements! Migrating from Windows PowerShell 5.1 to PowerShell 7 - PowerShell | Microsoft Docs
PS C:\Users\Andrew\Desktop\Moshify2> npm install parcel-bundler
npm WARN config global --global, --local are deprecated. Use --location=global instead.
npm WARN deprecated source-map-url@0.4.1: See GitHub - lydell/source-map-url: [DEPRECATED] Tools for working with sourceMappingURL comments.
npm WARN deprecated request-promise-native@1.0.9: request-promise-native has been deprecated because it extends the now deprecated request package, see https://github.com/request/request/issues/3142
npm WARN deprecated har-validator@5.1.5: this library is no longer supported
npm WARN deprecated chokidar@2.1.8: Chokidar 2 does not receive security updates since 2019. Upgrade to chokidar 3 with 15x fewer dependencies
npm WARN deprecated source-map-resolve@0.5.3: See GitHub - lydell/source-map-resolve: [DEPRECATED] Resolve the source map and/or sources for a generated file.
npm WARN deprecated resolve-url@0.2.1: GitHub - lydell/resolve-url: [DEPRECATED] Like Node.js’ `path.resolve`/`url.resolve` for the browser.
npm WARN deprecated urix@0.1.0: Please see GitHub - lydell/urix: [DEPRECATED] Makes Windows-style paths more unix and URI friendly.
npm WARN deprecated querystring@0.2.0: The querystring API is considered Legacy. new code should use the URLSearchParams API instead.
npm WARN deprecated uuid@3.4.0: Please upgrade to version 7 or higher. Older versions may use Math.random() in certain circumstances, which is known to be problematic. See There’s Math.random(), and then there’s Math.random() · V8 for details.
npm WARN deprecated request@2.88.2: request has been deprecated, see https://github.com/request/request/issues/3142
npm WARN deprecated svgo@1.3.2: This SVGO version is no longer supported. Upgrade to v2.x.x.
npm WARN deprecated parcel-bundler@1.12.5: Parcel v1 is no longer maintained. Please migrate to v2, which is published under the ‘parcel’ package. See Migration for details.
npm WARN deprecated core-js@2.6.12: core-js@<3.4 is no longer maintained and not recommended for usage due to the number of issues. Because of the V8 engine whims, feature detection in old core-js versions could cause a slowdown up to 100x even if nothing is polyfilled. Please, upgrade your dependencies to the actual version of core-js.
npm ERR! code 1
npm ERR! path C:\Users\Andrew\Desktop\Moshify2\node_modules\deasync
npm ERR! command failed
npm ERR! command C:\WINDOWS\system32\cmd.exe /d /s /c node ./build.js
npm ERR! gyp info it worked if it ends with ok
npm ERR! gyp info using node-gyp@9.0.0
npm ERR! gyp info using node@18.3.0 | win32 | x64
npm ERR! gyp ERR! find Python
npm ERR! gyp ERR! find Python Python is not set from command line or npm configuration
npm ERR! gyp ERR! find Python Python is not set from environment variable PYTHON
npm ERR! gyp ERR! find Python checking if “python3” can be used
npm ERR! gyp ERR! find Python - “python3” is not in PATH or produced an error
npm ERR! gyp ERR! find Python checking if “python” can be used
npm ERR! gyp ERR! find Python - “python” is not in PATH or produced an error
npm ERR! gyp ERR! find Python checking if Python is C:\Users\Andrew\AppData\Local\Programs\Python\Python39\python.exe
npm ERR! gyp ERR! find Python - “C:\Users\Andrew\AppData\Local\Programs\Python\Python39\python.exe” could not be run
npm ERR! gyp ERR! find Python checking if Python is C:\Program Files\Python39\python.exe
npm ERR! gyp ERR! find Python - “C:\Program Files\Python39\python.exe” could not be run
npm ERR! gyp ERR! find Python checking if Python is C:\Users\Andrew\AppData\Local\Programs\Python\Python39-32\python.exe
npm ERR! gyp ERR! find Python - “C:\Users\Andrew\AppData\Local\Programs\Python\Python39-32\python.exe” could not be run
npm ERR! gyp ERR! find Python checking if Python is C:\Program Files\Python39-32\python.exe
npm ERR! gyp ERR! find Python - “C:\Program Files\Python39-32\python.exe” could not be run
npm ERR! gyp ERR! find Python checking if Python is C:\Program Files (x86)\Python39-32\python.exe
npm ERR! gyp ERR! find Python - “C:\Program Files (x86)\Python39-32\python.exe” could not be run
npm ERR! gyp ERR! find Python checking if Python is C:\Users\Andrew\AppData\Local\Programs\Python\Python38\python.exe
npm ERR! gyp ERR! find Python - “C:\Users\Andrew\AppData\Local\Programs\Python\Python38\python.exe” could not be run
npm ERR! gyp ERR! find Python checking if Python is C:\Program Files\Python38\python.exe
npm ERR! gyp ERR! find Python - “C:\Program Files\Python38\python.exe” could not be run
npm ERR! gyp ERR! find Python checking if Python is C:\Users\Andrew\AppData\Local\Programs\Python\Python38-32\python.exe
npm ERR! gyp ERR! find Python - “C:\Users\Andrew\AppData\Local\Programs\Python\Python38-32\python.exe” could not be run
npm ERR! gyp ERR! find Python checking if Python is C:\Program Files\Python38-32\python.exe
npm ERR! gyp ERR! find Python - “C:\Program Files\Python38-32\python.exe” could not be run
npm ERR! gyp ERR! find Python checking if Python is C:\Program Files (x86)\Python38-32\python.exe
npm ERR! gyp ERR! find Python - “C:\Program Files (x86)\Python38-32\python.exe” could not be run
npm ERR! gyp ERR! find Python checking if Python is C:\Users\Andrew\AppData\Local\Programs\Python\Python37\python.exe
npm ERR! gyp ERR! find Python - “C:\Users\Andrew\AppData\Local\Programs\Python\Python37\python.exe” could not be run
npm ERR! gyp ERR! find Python checking if Python is C:\Program Files\Python37\python.exe
npm ERR! gyp ERR! find Python - “C:\Program Files\Python37\python.exe” could not be run
npm ERR! gyp ERR! find Python checking if Python is C:\Users\Andrew\AppData\Local\Programs\Python\Python37-32\python.exe
npm ERR! gyp ERR! find Python - “C:\Users\Andrew\AppData\Local\Programs\Python\Python37-32\python.exe” could not be run
npm ERR! gyp ERR! find Python checking if Python is C:\Program Files\Python37-32\python.exe
npm ERR! gyp ERR! find Python - “C:\Program Files\Python37-32\python.exe” could not be run
npm ERR! gyp ERR! find Python checking if Python is C:\Program Files (x86)\Python37-32\python.exe
npm ERR! gyp ERR! find Python - “C:\Program Files (x86)\Python37-32\python.exe” could not be run
npm ERR! gyp ERR! find Python checking if Python is C:\Users\Andrew\AppData\Local\Programs\Python\Python36\python.exe
npm ERR! gyp ERR! find Python - “C:\Users\Andrew\AppData\Local\Programs\Python\Python36\python.exe” could not be run
npm ERR! gyp ERR! find Python checking if Python is C:\Program Files\Python36\python.exe
npm ERR! gyp ERR! find Python - “C:\Program Files\Python36\python.exe” could not be run
npm ERR! gyp ERR! find Python checking if Python is C:\Users\Andrew\AppData\Local\Programs\Python\Python36-32\python.exe
npm ERR! gyp ERR! find Python - “C:\Users\Andrew\AppData\Local\Programs\Python\Python36-32\python.exe” could not be run
npm ERR! gyp ERR! find Python checking if Python is C:\Program Files\Python36-32\python.exe
npm ERR! gyp ERR! find Python - “C:\Program Files\Python36-32\python.exe” could not be run
npm ERR! gyp ERR! find Python checking if Python is C:\Program Files (x86)\Python36-32\python.exe
npm ERR! gyp ERR! find Python - “C:\Program Files (x86)\Python36-32\python.exe” could not be run
npm ERR! gyp ERR! find Python checking if the py launcher can be used to find Python 3
npm ERR! gyp ERR! find Python - “py.exe” is not in PATH or produced an error
npm ERR! gyp ERR! find Python
npm ERR! gyp ERR! find Python **********************************************************
npm ERR! gyp ERR! find Python You need to install the latest version of Python.
npm ERR! gyp ERR! find Python Node-gyp should be able to find and use Python. If not,
npm ERR! gyp ERR! find Python you can try one of the following options:
PS C:\Users\Andrew\Desktop\Moshify2> npm i -D parcel-bundler
npm WARN config global --global, --local are deprecated. Use --location=global instead.
npm WARN deprecated source-map-url@0.4.1: See GitHub - lydell/source-map-url: [DEPRECATED] Tools for working with sourceMappingURL comments.
npm WARN deprecated request-promise-native@1.0.9: request-promise-native has been deprecated because it extends the now deprecated request package, see https://github.com/request/request/issues/3142
npm WARN deprecated har-validator@5.1.5: this library is no longer supported
npm WARN deprecated chokidar@2.1.8: Chokidar 2 does not receive security updates since 2019. Upgrade to chokidar 3 with 15x fewer dependencies
npm WARN deprecated source-map-resolve@0.5.3: See GitHub - lydell/source-map-resolve: [DEPRECATED] Resolve the source map and/or sources for a generated file.
npm WARN deprecated resolve-url@0.2.1: GitHub - lydell/resolve-url: [DEPRECATED] Like Node.js’ `path.resolve`/`url.resolve` for the browser.
npm WARN deprecated urix@0.1.0: Please see GitHub - lydell/urix: [DEPRECATED] Makes Windows-style paths more unix and URI friendly.
npm WARN deprecated querystring@0.2.0: The querystring API is considered Legacy. new code should use the URLSearchParams API instead.
npm WARN deprecated uuid@3.4.0: Please upgrade to version 7 or higher. Older versions may use Math.random() in certain circumstances, which is known to be problematic. See There’s Math.random(), and then there’s Math.random() · V8 for details.
npm WARN deprecated request@2.88.2: request has been deprecated, see https://github.com/request/request/issues/3142
npm WARN deprecated svgo@1.3.2: This SVGO version is no longer supported. Upgrade to v2.x.x.
npm WARN deprecated parcel-bundler@1.12.5: Parcel v1 is no longer maintained. Please migrate to v2, which is published under the ‘parcel’ package. See Migration for details.
npm WARN deprecated core-js@2.6.12: core-js@<3.4 is no longer maintained and not recommended for usage due to the number of issues. Because of the V8 engine whims, feature detection in old core-js versions could cause a slowdown up to 100x even if nothing is polyfilled. Please, upgrade your dependencies to the actual version of core-js.
npm ERR! code 1
npm ERR! path C:\Users\Andrew\Desktop\Moshify2\node_modules\deasync
npm ERR! command failed
npm ERR! command C:\WINDOWS\system32\cmd.exe /d /s /c node ./build.js
npm ERR! gyp info it worked if it ends with ok
npm ERR! gyp info using node-gyp@9.0.0
npm ERR! gyp info using node@18.3.0 | win32 | x64
npm ERR! gyp ERR! find Python
npm ERR! gyp ERR! find Python Python is not set from command line or npm configuration
npm ERR! gyp ERR! find Python Python is not set from environment variable PYTHON
npm ERR! gyp ERR! find Python checking if “python3” can be used
npm ERR! gyp ERR! find Python - “python3” is not in PATH or produced an error
npm ERR! gyp ERR! find Python checking if “python” can be used
npm ERR! gyp ERR! find Python - “python” is not in PATH or produced an error
npm ERR! gyp ERR! find Python checking if Python is C:\Users\Andrew\AppData\Local\Programs\Python\Python39\python.exe
npm ERR! gyp ERR! find Python - “C:\Users\Andrew\AppData\Local\Programs\Python\Python39\python.exe” could not be run
npm ERR! gyp ERR! find Python checking if Python is C:\Program Files\Python39\python.exe
npm ERR! gyp ERR! find Python - “C:\Program Files\Python39\python.exe” could not be run
npm ERR! gyp ERR! find Python checking if Python is C:\Users\Andrew\AppData\Local\Programs\Python\Python39-32\python.exe
npm ERR! gyp ERR! find Python - “C:\Users\Andrew\AppData\Local\Programs\Python\Python39-32\python.exe” could not be run
npm ERR! gyp ERR! find Python checking if Python is C:\Program Files\Python39-32\python.exe
npm ERR! gyp ERR! find Python - “C:\Program Files\Python39-32\python.exe” could not be run
npm ERR! gyp ERR! find Python checking if Python is C:\Program Files (x86)\Python39-32\python.exe
npm ERR! gyp ERR! find Python - “C:\Program Files (x86)\Python39-32\python.exe” could not be run
npm ERR! gyp ERR! find Python checking if Python is C:\Users\Andrew\AppData\Local\Programs\Python\Python38\python.exe
npm ERR! gyp ERR! find Python - “C:\Users\Andrew\AppData\Local\Programs\Python\Python38\python.exe” could not be run
npm ERR! gyp ERR! find Python checking if Python is C:\Program Files\Python38\python.exe
npm ERR! gyp ERR! find Python - “C:\Program Files\Python38\python.exe” could not be run
npm ERR! gyp ERR! find Python checking if Python is C:\Users\Andrew\AppData\Local\Programs\Python\Python38-32\python.exe
npm ERR! gyp ERR! find Python - “C:\Users\Andrew\AppData\Local\Programs\Python\Python38-32\python.exe” could not be run
npm ERR! gyp ERR! find Python checking if Python is C:\Program Files\Python38-32\python.exe
npm ERR! gyp ERR! find Python - “C:\Program Files\Python38-32\python.exe” could not be run
npm ERR! gyp ERR! find Python checking if Python is C:\Program Files (x86)\Python38-32\python.exe
npm ERR! gyp ERR! find Python - “C:\Program Files (x86)\Python38-32\python.exe” could not be run
npm ERR! gyp ERR! find Python checking if Python is C:\Users\Andrew\AppData\Local\Programs\Python\Python37\python.exe
npm ERR! gyp ERR! find Python - “C:\Users\Andrew\AppData\Local\Programs\Python\Python37\python.exe” could not be run
npm ERR! gyp ERR! find Python checking if Python is C:\Program Files\Python37\python.exe
npm ERR! gyp ERR! find Python - “C:\Program Files\Python37\python.exe” could not be run
npm ERR! gyp ERR! find Python checking if Python is C:\Users\Andrew\AppData\Local\Programs\Python\Python37-32\python.exe
npm ERR! gyp ERR! find Python - “C:\Users\Andrew\AppData\Local\Programs\Python\Python37-32\python.exe” could not be run
npm ERR! gyp ERR! find Python checking if Python is C:\Program Files\Python37-32\python.exe
npm ERR! gyp ERR! find Python - “C:\Program Files\Python37-32\python.exe” could not be run
npm ERR! gyp ERR! find Python checking if Python is C:\Program Files (x86)\Python37-32\python.exe
npm ERR! gyp ERR! find Python - “C:\Program Files (x86)\Python37-32\python.exe” could not be run
npm ERR! gyp ERR! find Python checking if Python is C:\Users\Andrew\AppData\Local\Programs\Python\Python36\python.exe
npm ERR! gyp ERR! find Python - “C:\Users\Andrew\AppData\Local\Programs\Python\Python36\python.exe” could not be run
npm ERR! gyp ERR! find Python checking if Python is C:\Program Files\Python36\python.exe
npm ERR! gyp ERR! find Python - “C:\Program Files\Python36\python.exe” could not be run
npm ERR! gyp ERR! find Python checking if Python is C:\Users\Andrew\AppData\Local\Programs\Python\Python36-32\python.exe
npm ERR! gyp ERR! find Python - “C:\Users\Andrew\AppData\Local\Programs\Python\Python36-32\python.exe” could not be run
npm ERR! gyp ERR! find Python checking if Python is C:\Program Files\Python36-32\python.exe
npm ERR! gyp ERR! find Python - “C:\Program Files\Python36-32\python.exe” could not be run
npm ERR! gyp ERR! find Python checking if Python is C:\Program Files (x86)\Python36-32\python.exe
npm ERR! gyp ERR! find Python - “C:\Program Files (x86)\Python36-32\python.exe” could not be run
npm ERR! gyp ERR! find Python checking if the py launcher can be used to find Python 3
npm ERR! gyp ERR! find Python - “py.exe” is not in PATH or produced an error
npm ERR! gyp ERR! find Python
npm ERR! gyp ERR! find Python **********************************************************
npm ERR! gyp ERR! find Python You need to install the latest version of Python.
npm ERR! gyp ERR! find Python Node-gyp should be able to find and use Python. If not,
npm ERR! gyp ERR! find Python you can try one of the following options:
npm ERR! gyp ERR! find Python - Use the switch --python=“C:\Path\To\python.exe”
npm ERR! gyp ERR! find Python (accepted by both node-gyp and npm)
npm ERR! gyp ERR! find Python - Set the environment variable PYTHON
npm ERR! gyp ERR! find Python - Set the npm configuration variable python:
npm ERR! gyp ERR! find Python npm config set python “C:\Path\To\python.exe”
npm ERR! gyp ERR! find Python For more information consult the documentation at:
npm ERR! gyp ERR! find Python GitHub - nodejs/node-gyp: Node.js native addon build tool
npm ERR! gyp ERR! find Python **********************************************************
npm ERR! gyp ERR! find Python
npm ERR! gyp ERR! configure error
npm ERR! gyp ERR! stack Error: Could not find any Python installation to use
npm ERR! gyp ERR! stack at PythonFinder.fail (C:\Program Files\nodejs\node_modules\npm\node_modules\node-gyp\lib\find-python.js:330:47)
npm ERR! gyp ERR! stack at PythonFinder.runChecks (C:\Program Files\nodejs\node_modules\npm\node_modules\node-gyp\lib\find-python.js:159:21)
npm ERR! gyp ERR! stack at PythonFinder. (C:\Program Files\nodejs\node_modules\npm\node_modules\node-gyp\lib\find-python.js:228:18)
npm ERR! gyp ERR! stack at PythonFinder.execFileCallback (C:\Program Files\nodejs\node_modules\npm\node_modules\node-gyp\lib\find-python.js:294:16)
npm ERR! gyp ERR! stack at exithandler (node:child_process:395:5)
npm ERR! gyp ERR! stack at ChildProcess.errorhandler (node:child_process:407:5)
npm ERR! gyp ERR! stack at ChildProcess.emit (node:events:527:28)
npm ERR! gyp ERR! stack at ChildProcess._handle.onexit (node:internal/child_process:289:12)
npm ERR! gyp ERR! stack at onErrorNT (node:internal/child_process:476:16)
npm ERR! gyp ERR! stack at process.processTicksAndRejections (node:internal/process/task_queues:82:21)
npm ERR! gyp ERR! System Windows_NT 10.0.22000
npm ERR! gyp ERR! command “C:\Program Files\nodejs\node.exe” “C:\Program Files\nodejs\node_modules\npm\node_modules\node-gyp\bin\node-gyp.js” “rebuild”
npm ERR! gyp ERR! cwd C:\Users\Andrew\Desktop\Moshify2\node_modules\deasync
npm ERR! gyp ERR! node -v v18.3.0
npm ERR! gyp ERR! node-gyp -v v9.0.0
npm ERR! gyp ERR! not ok
npm ERR! Build failed

npm ERR! A complete log of this run can be found in:
npm ERR! C:\Users\Andrew\AppData\Local\npm-cache_logs\2022-06-08T18_22_52_560Z-debug-0.log
PS C:\Users\Andrew\Desktop\Moshify2>

I simply typed what Mosh said: (npm i -D parcel-bundler).

Have you installed Python 3 for Windows?